﻿PPN,age,sex,oxytocin_0,oxytocin_1,IOS_stranger,IOS_mother,IOS_father,LW_self,LW_mother,LW_father,LW_stranger,CLOSE_father,CLOSE_mother,CLOSE_stranger,PTM,RSS,altruism,honesty,emotiolity,extraversion,agreeableness,conscientiousness,openness,ext_neuro,FATHER_self2other2,FATHER_self0other4,FATHER_self4other0,FATHER_bothnogain,MOTHER_self2other2,MOTHER_self0other4,MOTHER_self4other0,MOTHER_bothnogain,STRANGER_self2other2,STRANGER_self0other4,STRANGER_self4other0,STRANGER_bothnogain,sd_total_points,NrCooperations_total_pd,NrCooperations_total_sd,NrDefections_total_pd,NrDefections_total_sd,NrCooperations_total_mother,NrCooperations_total_father,NrCooperations_total_stranger,NrDefections_total_mother,NrDefections_total_father,NrDefections_total_stranger,NrCooperationsMother_pd,NrCooperationsFather_pd,NrCooperationsStranger_pd,NrCooperationsMother_sd,NrCooperationsFather_sd,NrCooperationsStranger_sd,NrDefectionsMother_pd,NrDefectionsFather_pd,NrDefectionsStranger_pd,NrDefectionsMother_sd,NrDefectionsFather_sd,NrDefectionsStranger_sd
BL1P065,16.8,female,1,1.47,1,5,3,3,4,4,3,3,5,3,0.4,37,3,4.6,2.4,2.3,2.7,3.4,2.7,-1.3,0.2523,-6.1266,-2.7644,-7.0811,-3.8194,-2.2556,-3.975,-5.4168,-5.5468,-4.9971,-6.6615,-5.7063,,,,,,,,,,,,,,,,,,,,,,,
BL1P066,17.2,female,0.86,0.66,4,6,5,5,5,5,5,4,5,3,3.1,26,3,4,3.6,2.9,3.6,3.9,3,0.5,-2.4676,-2.8786,-4.5544,-6.5928,-1.7278,-3.9315,5.0818,-5.8586,-3.9481,-6.797,-4.3005,-7.2883,,,,,,,,,,,,,,,,,,,,,,,
BL1P067,16.9,male,1,1.04,2,6,6,7,6,6,2,5,5,2,-4.1,35,2.75,3.5,2.6,3.3,2.9,3.1,2,-0.1,-2.658,1.9129,1.3295,-4.62,-1.0595,3.1511,0.3066,-1.3567,-1.305,-2.5462,-2.7929,-2.9305,99,0,17,18,1,6,5,6,6,6,6,0,0,0,6,5,6,6,6,6,0,1,0
BL1P068,14.3,female,1.12,1.72,4,7,7,5,6,6,5,7,7,6,4.6,36,3.25,4,3.9,3.6,3.4,3,3.4,1.5,-4.6947,-1.4412,-0.7862,0.7252,-3.3049,-3.778,-4.1055,-3.3331,-3.3117,-2.9085,-1.6199,-2.1498,72,18,17,0,1,12,11,12,0,0,0,6,6,6,6,5,6,0,0,0,0,1,0
BL1P070,17.2,male,1.3,1.83,,,,,,,,,,,-1.2,18,3,2,1.8,3.4,3.6,3.3,2.8,-0.8,-1.8493,0.4595,1.9888,-5.0672,0.8839,-6.0038,0.0606,-2.8283,-4.411,-2.2574,-3.6918,-1.085,,,,,,,,,,,,,,,,,,,,,,,
BL1P071,17.8,male,0.94,1.76,4,5,2,6,6,5,3,6,7,3,,,,,,,,,,,1.9532,0.7739,2.2384,-5.3919,3.3134,4.6864,4.4657,-5.2178,2.2313,3.3062,-1.114,-0.8449,,,,,,,,,,,,,,,,,,,,,,,
BL1P072,15.8,male,1.14,1.75,2,5,4,3,4,4,4,5,5,3,-1.1,39,2.75,3.8,2,3.1,3.6,3.6,2.7,-0.9,-2.2233,1.0239,-5.7917,-1.3294,-3.9162,1.831,-2.8554,0.3401,-1.6143,-0.7577,0.2346,2.4751,,,,,,,,,,,,,,,,,,,,,,,
BL1P073,14.2,female,1.08,1.41,1,4,4,3,5,5,3,6,6,1,-4,21,2.5,3.5,2.7,2.3,3.4,3,3.5,-1,-2.184,3.1504,-1.0246,-0.9263,-2.2259,0.7143,-5.903,2.1692,3.0777,-0.6473,2.6276,-4.3122,,,,,,,,,,,,,,,,,,,,,,,
BL1P074,16.6,female,1.6,1.65,2,7,6,5,5,5,5,2,2,2,-4.8,32,2.5,3.8,3.1,3.3,4,2.6,3.1,0.4,-2.2872,-0.5247,-0.2775,-1.273,1.0579,-3.3706,-4.514,-0.659,-0.5199,-2.9198,3.0003,-1.9356,,,,,,,,,,,,,,,,,,,,,,,
BL1P075,15.8,female,1.62,1.62,2,7,5,5,6,5,4,5,6,2,0.5,29,3.25,2.5,3.6,3.1,2.2,2.7,2.3,0.7,-1.4038,1.8563,-1.2368,-3.7041,-4.2005,1.7672,-2.4318,-1.2913,-0.7723,-2.5073,-0.262,-2.4784,,,,,,,,,,,,,,,,,,,,,,,
BL1P076,17.4,female,1.07,2,3,6,6,6,7,7,4,7,7,2,0.6,37,3.25,3.9,3.8,3.9,2.6,4.1,3.3,1.7,-2.5235,0.7285,-4.4489,-0.2744,-4.0536,-1.2935,-3.8692,-3.6829,-5.4471,-4.7594,-0.1446,-1.3013,,,,,,,,,,,,,,,,,,,,,,,
BL1P077,17.3,female,1.22,2.2,1,5,5,6,5,5,3,4,4,1,-0.1,40,2.5,3.3,2.6,3,3.6,3.4,3.1,-0.4,-2.6274,-2.0375,0.7595,-1.7877,-2.4685,-0.5809,-2.3029,1.3505,0.0022,-4.2653,-0.8331,-1.085,,,,,,,,,,,,,,,,,,,,,,,
BL1P079,17.8,male,1.54,1.44,4,6,6,5,5,5,5,7,7,5,0.6,36,2.75,4,3.2,3.4,3.7,3.4,3.5,0.6,1.3866,-0.5962,-1.9869,-2.0168,-1.6822,-0.4089,0.7811,-0.5363,2.2319,0.0376,2.3676,0.3982,,,,,,,,,,,,,,,,,,,,,,,
BL1P081,17,female,1.15,2.11,2,6,5,6,5,5,2,2,2,3,1.3,31,3,2.5,3.6,3.4,3,3,3.9,1,-0.617,0.7736,-2.7751,-3.2109,-3.0636,-1.3905,-1.4503,-5.3547,-3.0088,-2.9277,2.2087,0.5902,82,10,13,8,5,10,1,12,2,2,2,4,0,6,6,1,6,2,6,0,0,5,0
BL1P082,16.9,female,1.12,1.99,2,6,6,5,5,5,4,5,6,2,-4.7,33,2.5,2.8,3.3,3.1,2.4,3.5,2.6,0.4,0.8805,1.2328,-2.6786,-1.8535,0.8137,0.7103,-1.9072,1.2284,-0.3167,1.0306,0.2302,-0.6483,,,,,,,,,,,,,,,,,,,,,,,
BL1P083,16.6,male,0.96,1.14,2,6,5,6,6,6,5,5,5,3,-1,43,3.25,2.7,2.1,3.5,2.9,3.2,2.4,-0.4,5.4109,5.1611,2.6119,3.0646,2.7926,4.2199,0.3554,-2.6099,5.456,0.3738,2.07,0.7228,,,,,,,,,,,,,,,,,,,,,,,
BL1P084,14.5,female,1.06,0.92,2,7,7,5,6,6,6,4,4,4,-1.7,22,3,2.9,3.3,2.8,2.4,3,1.7,0.1,-1.0807,-2.0771,-0.3143,-2.9518,-1.1114,-0.8893,-5.3882,-2.4108,-0.4513,-4.5844,1.5275,-5.0006,,,,,,,,,,,,,,,,,,,,,,,
BL1P085,16.6,female,1.19,0.98,4,7,6,7,6,5,3,5,7,2,1.3,37,2.75,3.8,3.8,3.4,3,3.8,3.2,1.2,-3.3331,3.9437,5.2649,1.6025,-1.1102,-1.1404,-1.202,-2.879,4.8968,0.054,0.3239,-0.8732,,,,,,,,,,,,,,,,,,,,,,,
BL1P086,14.1,male,1.24,0.68,1,7,7,7,5,5,3,2,2,2,0.8,41,2.5,3.1,3.2,3.8,3.1,3.2,2.6,1,-0.9593,0.3376,-2.4021,1.3859,0.5285,-3.9461,-1.8812,0.7412,-0.4286,-1.7939,1.0023,-2.5802,,,,,,,,,,,,,,,,,,,,,,,
BL1P087,11.8,female,1.08,0.71,1,7,7,5,5,5,5,7,7,1,3.9,35,,,,,,,,,-0.4834,0.0718,-1.1271,-4.2893,2.4232,3.128,1.9629,0.8127,3.5514,-7.1109,1.1975,-1.1682,,,,,,,,,,,,,,,,,,,,,,,
BL1P088,14.8,male,1.48,1.63,3,5,5,5,5,5,4,6,6,2,-2.3,39,2.25,4.1,2.5,3.4,3.9,1.9,2.3,-0.1,-4.7422,-2.8289,-0.7821,-5.27,-5.8382,0.796,0.9295,-0.717,0.6959,-2.3973,-3.5381,-2.2187,,,,,,,,,,,,,,,,,,,,,,,
BL1P089,14.4,male,1.5,0.85,1,6,5,6,6,6,3,6,7,2,2.4,29,2.25,3.1,2.4,3.9,3.6,3.4,2.2,0.3,,,,,,,,,,,,,,,,,,,,,,,,,,,,,,,,,,,
BL1P090,16.2,female,2.03,1.02,4,5,3,5,5,5,4,3,6,2,0.9,38,2.75,3.4,3.3,3.7,2.8,2.5,3.3,1,2.6534,-2.0514,-3.4168,-1.284,0.9469,1.1532,-1.9576,0.7765,4.6113,1.1743,0.7889,-1.071,,,,,,,,,,,,,,,,,,,,,,,
BL1P092,12.2,male,1.56,0.93,2,6,6,5,3,3,4,5,5,2,1.1,35,2.75,4,2.7,3.2,3.3,3.4,3.1,-0.1,0.5074,-2.2546,1.4083,-2.4264,-0.2071,-5.2992,3.486,2.357,-1.8603,-2.6763,1.0717,-0.0552,,,,,,,,,,,,,,,,,,,,,,,
BL1P093,16.7,female,1.58,0.82,4,6,5,5,5,5,3,6,5,1,-2,45,2.75,2.9,3,4.1,3.6,4,3.5,1.1,-1.7649,-1.1269,-1.2701,-1.9441,0.2048,-0.6508,-3.699,0.2993,-1.6096,-1.8161,2.9674,-1.8197,,,,,,,,,,,,,,,,,,,,,,,
BL1P094,16.9,female,2.58,,3,5,5,5,5,5,4,5,5,3,,,,,,,,,,,-2.0902,0.8877,-1.3025,-0.8286,-2.3189,-3.3551,-1.3677,-1.7936,-1.9927,-0.2104,-1.1638,-2.328,,,,,,,,,,,,,,,,,,,,,,,
BL1P095,13.6,female,1.74,1.48,2,5,6,5,5,5,5,6,6,3,-1.3,43,2.75,4.1,3.1,3.7,3.5,3.6,2.5,0.8,0.3068,1.7035,3.0246,-3.2599,-3.9544,1.682,0.6497,-0.2778,1.2527,0.732,0.5814,-2.4386,87,7,14,11,4,5,9,7,7,7,7,0,4,3,5,5,4,6,2,3,1,1,2
BL1P096,17,male,1.59,2.01,2,4,5,5,5,5,5,5,5,2,0.5,37,,,,,,,,,-1.4898,-0.5208,-5.2974,-5.0267,-2.3349,-3.3721,0.3891,-2.6321,-4.4138,-5.2929,-0.3882,-6.24,,,,,,,,,,,,,,,,,,,,,,,
BL1P097,16.9,female,1.6,1.65,4,6,5,6,5,5,4,5,6,3,3.2,37,3.25,3.8,3.6,3.5,4,3.6,3.9,1.1,-3.2699,-2.2467,1.2452,-1.9688,1.2901,1.723,1.575,-2.151,-0.9434,-4.3534,0.5463,-3.8154,,,,,,,,,,,,,,,,,,,,,,,
BL1P098,15.8,female,2.12,1.25,3,7,6,5,4,4,4,4,4,1,1,39,3.25,3.6,3.4,3.8,2.9,2.9,3.1,1.2,-0.1357,-0.0059,-2.6763,-2.4893,-0.6781,-2.9439,0.5324,-1.6192,-0.8043,-1.8625,-1.6436,-2.3851,90,6,18,12,0,8,8,8,4,4,4,2,2,2,6,6,6,4,4,4,0,0,0
BL1P099,16.2,female,1.94,1.46,1,1,7,5,2,5,4,3,2,1,-3.2,16,2.5,3.1,3.2,3.2,3.8,4.1,2.2,0.4,-0.4854,-5.6339,-3.1958,-4.7236,-0.5969,-2.3625,-0.2558,-3.6309,-1.1699,-4.8499,-0.7965,-3.8043,,,,,,,,,,,,,,,,,,,,,,,
BL1P100,16.1,male,1.08,1.86,2,7,7,6,6,6,2,7,7,1,-1.7,41,2.75,3.3,2.4,3.2,3.1,3.5,2.5,-0.4,-4.5073,-1.2078,1.5965,-1.3451,-0.037,-3.4265,1.0421,-0.7419,5.2555,-3.8061,-2.2225,-2.1787,,,,,,,,,,,,,,,,,,,,,,,
BL1P101,12.5,male,0.99,1.89,2,6,6,6,5,5,1,7,7,2,0,34,2.25,3.3,3.3,3.4,2.3,3.6,3.9,0.7,-3.5318,-1.3141,1.7036,0.8514,-3.7004,-0.8829,-0.9941,-5.9199,-2.2669,-2.6355,0.7177,-0.8142,95,16,16,2,7,6,5,5,5,5,1,1,0,6,5,5,5,5,6,0,1,1,
BL1P102,12.4,female,0.96,1.83,1,7,6,4,7,6,4,7,7,3,-7.9,40,2.25,4.3,3.1,3.8,2.9,3.6,3.3,0.9,1.7846,-0.1615,4.1434,1.0358,1.5177,0.4464,3.0746,1.1306,-0.1716,2.4978,2.5072,2.7921,,,,,,,,,,,,,,,,,,,,,,,
BL1P104,11.6,female,0.77,0.8,3,5,5,5,5,5,5,6,6,4,4,35,,,,,,,,,0.4235,-0.4315,-4.5021,-2.0838,3.0536,1.1652,3.6275,-1.446,-2.845,-0.3897,1.0328,-0.4109,,,,,,,,,,,,,,,,,,,,,,,
BL1P105,17.3,female,1.14,0.81,4,6,6,6,5,5,2,6,6,3,-1.6,42,2.5,3.6,3.6,4.2,2.8,3.5,2.5,1.8,-2.0361,-5.3385,-2.778,-1.1093,-0.7163,-3.3936,-2.2436,-3.9314,-1.6555,-1.5339,-5.2757,-2.0715,86,7,13,11,5,8,11,1,4,4,4,2,5,0,6,6,1,4,1,6,0,0,5
BL1P106,17.8,female,0.89,0.66,2,7,4,6,6,5,4,4,7,1,1.7,43,2.5,3.8,3.3,3.7,3.4,4.3,2,1,1.8363,-0.1224,-0.7202,-1.8617,1.9163,0.1663,-0.219,-0.8835,-0.6581,-2.3657,1.2488,-4.1074,,,,,,,,,,,,,,,,,,,,,,,
BL1P107,12.2,male,0.88,0.77,,,,5,5,5,4,2,2,2,4.5,44,2.75,4,3.4,4.3,2.9,2.6,2.7,1.7,,,,,,,,,,,,,,,,,,,,,,,,,,,,,,,,,,,
BL1P108,13.9,female,0.98,1.05,2,7,6,6,6,6,2,5,5,1,1.1,44,3,3.6,2.9,3.7,3.5,3.7,3.1,0.6,0.0068,1.0924,-1.8469,0.1289,-0.6036,0.4208,7.3817,3.676,1.9786,4.2364,-3.2609,-1.875,,,,,,,,,,,,,,,,,,,,,,,
BL1P109,13.8,female,1,0.97,4,7,6,7,6,5,2,7,7,2,-0.1,24,3.5,2.6,3.2,3.3,2.9,2.9,2.5,0.5,0.6573,0.1578,-1.1317,-2.4968,3.4303,5.445,-1.3745,0.4535,-0.1949,-2.5314,0.1242,-1.8453,85,8,14,10,4,8,7,7,4,4,4,2,3,3,6,4,4,4,3,3,0,2,2
BL1P110,11.3,female,1.01,1,,,,4,5,5,4,5,5,4,-4.2,40,,,,,,,,,,,,,,,,,,,,,,,,,,,,,,,,,,,,,,,,,,,
BL1P111,15.3,female,0.88,1.06,3,6,6,5,6,6,6,3,3,2,6.6,38,3.25,2.6,4.1,4.1,2.8,4.1,3.7,2.2,-0.6373,0.9689,-1.1351,-4.2824,-1.2231,-1.2294,-2.0928,-1.0421,-0.1701,-6.4424,-0.5225,-2.7113,,,,,,,,,,,,,,,,,,,,,,,
BL1P112,16.1,male,1.15,0.86,3,5,4,7,6,4,1,4,6,1,1.1,35,3.25,3.2,4.1,4.1,4,2.1,3.7,2.2,0.3749,-1.4093,-1.2658,-5.2361,-4.95,-0.8657,1.7851,-4.7469,-3.6554,-5.1929,-3.7584,-4.6625,89,6,15,12,3,10,7,4,2,2,2,4,1,1,6,6,3,2,5,5,0,0,3
BL1P113,13.9,male,1.05,0.72,3,6,5,6,5,5,3,4,4,3,-5.3,37,2.5,3.9,3,3.1,2.9,3.3,1.6,0.1,-4.3544,-1.7859,-9.8298,-6.6091,-5.0927,-2.9196,-5.8092,-3.8719,-0.4663,-6.6809,-4.0746,-2.2928,77,13,13,5,5,11,11,4,1,1,1,5,5,3,6,6,1,1,1,3,0,0,5
BL1P115,15.6,female,1.12,0.94,2,7,7,4,5,5,5,7,7,4,3.1,29,3,4.1,3.9,3.6,3.9,3.7,2,1.5,-3.9778,0.9609,-0.3887,-1.0213,3.5841,2.1297,0.6327,2.0345,-0.4564,-3.3952,-1.9361,-1.1988,,,,,,,,,,,,,,,,,,,,,,,
BL1P116,15.5,female,1.12,0.93,2,7,4,7,7,4,3,4,7,3,-4.2,23,2.25,3.1,2.9,2.4,1.9,3.1,2.5,-0.7,1.4224,-0.0344,0.6341,0.8983,-0.2538,0.046,2.6219,-0.0563,-0.4393,-2.371,0.7516,0.1246,73,14,7,4,11,6,5,10,6,6,6,5,5,4,1,0,6,1,1,2,5,6,0
BL1P117,15.4,female,1.07,1.14,4,6,6,5,5,5,4,3,4,5,-2,35,3,4,3.6,3.4,3.6,4,2.7,1,2.0711,3.1032,0.4974,-6.2324,4.2898,-2.8678,4.5684,0.042,4.5966,-0.9837,0.8901,1.1631,86,9,18,9,0,8,9,10,4,4,4,2,3,4,6,6,6,4,3,2,0,0,0
BL1P118,12.5,male,0.89,0.75,,,,6,5,5,3,6,6,2,-4.9,34,3.25,2.9,3.3,3.8,2.4,2.3,3.4,1.1,,,,,,,,,,,,,,,,,,,,,,,,,,,,,,,,,,,
BL1P121,15.2,male,0.94,0.98,4,6,4,2,3,3,2,3,4,2,2.4,32,2.75,2.7,2.5,3.7,3.6,2.9,4.1,0.2,3.1856,-2.5342,0.3802,-1.0275,-2.6308,-1.9901,-0.0313,0.0696,-4.9919,-1.846,-0.4446,-5.5744,90,4,11,14,7,6,6,3,6,6,6,2,2,0,4,4,3,4,4,6,2,2,3
BL1P122,8.3,male,,0.88,2,5,4,7,5,5,4,5,6,4,-4.1,42,,,,,,,,,-0.3157,-3.466,1.2443,-1.8161,-1.4131,-0.9087,0.8555,-4.4357,-1.5844,-1.8106,-2.6302,-5.4426,87,6,11,12,7,6,5,6,6,6,6,2,2,2,4,3,4,4,4,4,2,3,2
BL1P123,12.5,female,0.91,0.73,3,5,4,6,6,7,5,6,6,5,-0.4,20,3.25,3.6,3.6,2.4,2.9,2.6,3.5,0,2.8013,0.7242,1.0955,-0.6465,2.7469,2.0516,-2.5551,1.3344,0.9889,-0.425,2.5491,-5.2198,80,12,15,6,3,10,11,6,2,2,2,5,5,2,5,6,4,1,1,4,1,0,2
BL1P124,13.5,female,1.17,0.73,2,7,7,6,6,6,5,7,7,4,1.7,40,2.75,3.7,1.9,2.4,2.6,4.6,3.8,-1.7,0.8929,-0.4809,0.3856,-3.4743,1.9164,-2.7075,2.1588,-2.1654,0.4192,-1.865,-1.9563,-3.4181,78,10,6,8,12,4,5,7,8,8,8,3,3,4,1,2,3,3,3,2,5,4,3
BL1P125,13.5,male,1.06,0.84,4,7,6,6,6,6,5,6,6,4,4.9,37,3.25,3.1,2.8,3.6,3.8,4.4,3.9,0.4,-1.3618,-5.8395,-0.5108,-4.5163,0.0342,-1.2982,-0.9633,-2.0069,-0.9152,-3.7365,0.7341,-7.7216,74,15,13,3,5,8,10,10,4,4,4,5,4,6,3,6,4,1,2,0,3,0,2
BL1P127,10.4,female,1.01,0.96,4,5,5,5,5,5,3,5,4,2,-5.6,38,,,,,,,,,-1.5409,0.3742,-2.4409,-1.6651,-0.2813,-3.7255,0.1654,1.0135,-1.0041,-2.2547,-1.6967,-3.2472,86,7,13,11,5,9,8,3,3,3,3,5,2,0,4,6,3,1,4,6,2,0,3
BL1P128,16.2,female,1.32,1.11,3,6,5,7,5,6,1,6,4,1,-3.2,,2,2.6,2.8,3.8,3.3,2.1,3.5,0.6,0.2149,-3.4015,-1.1371,-4.6561,-3.3248,-3.9479,-3.7849,-5.9027,-1.9753,-5.0385,1.5587,-3.791,91,1,5,17,13,2,4,0,10,10,10,0,1,0,2,3,0,6,5,6,4,3,6
BL1P129,12.9,male,1.43,1.04,2,6,4,5,5,5,3,5,6,3, ,33,2.75,2.5,2.7,3.2,2.9,3.3,3.7,-0.1,1.5706,0.5717,-1.445,-0.0812,-1.1148,0.4997,-3.8709,2.6539,-1.6625,1.1196,0.5635,-0.0987,80,11,12,7,6,10,9,4,2,2,2,6,3,2,4,6,2,0,3,4,2,0,4
BL1P130,14.7,male,1.45,1.34,1,6,5,7,6,6,1,2,2,1,-3.3,41,3,2.8,1.9,3.9,3.3,2.6,2.5,-0.2,1.786,3.2771,-2.9897,-3.8218,-3.3951,-2.9844,3.1105,-3.1607,0.7562,-1.6025,0.9885,-8.2759,92,3,12,15,6,5,6,4,7,7,7,1,1,1,4,5,3,5,5,5,2,1,3
BL1P131,14.5,male,1.33,0.72,4,7,7,3,6,6,5,6,6,5,3.4,34,2,3.4,3.1,3.1,3.2,3.8,3.1,0.2,-2.2369,-3.1706,-0.2026,-3.6195,1.5422,-1.4018,0.4687,0.8998,-1.0707,0.1757,-1.0285,1.3527,74,17,18,1,0,12,12,11,0,0,0,6,6,5,6,6,6,0,0,1,0,0,0
BL1P132,11.2,male,1.47,0.78,3,6,6,4,5,5,2,6,6,2,2.8,40,,,,,,,,,3.8777,1.6005,-5.4407,-2.5276,2.1852,-1.6408,6.0931,-4.605,1.8289,-0.9673,0.9231,0.3009,84,9,14,9,4,10,7,6,2,2,2,5,3,1,5,4,5,1,3,5,1,2,1
BL1P133,13.4,male,1.52,0.98,4,6,6,5,5,5,4,5,5,4,-3.4,38,2.5,2.8,2.8,3.9,2.9,2.9,3.3,0.7,-1.4844,0.0785,4.1679,0.1036,-4.78,1.2092,-9.7824,-1.1628,-8.2936,-3.2193,-7.535,-5.5236,78,14,17,4,1,11,9,11,1,1,1,5,4,5,6,5,6,1,2,1,0,1,0
BL1P134,10.8,male,1.29,0.67,3,6,6,6,4,4,4,6,6,4,2.2,45,,,,,,,,,2.2002,2.8848,-1.1829,-0.9567,0.7326,-1.5854,-1.7341,-1.1606,2.3515,0.0518,-1.1896,-2.4478,97,1,16,17,2,6,5,6,6,6,6,1,0,0,5,5,6,5,6,6,1,1,0
BL1P135,11.1,female,1.67,1.15,,,,6,6,6,6,6,6,6,4.2,34,,,,,,,,,1.8921,-0.5825,-0.2245,-0.3536,5.4094,1.1101,-0.335,1.1553,-0.1044,-1.812,0.4068,-3.5288,83,8,9,10,9,5,5,7,7,7,7,2,2,4,3,3,3,4,4,2,3,3,3
BL1P136,16.3,female,1.18,1.3,1,7,4,7,5,4,2,4,6,1,-2.4,43,3.25,3.6,3.1,3.4,2.3,3.9,2.3,0.5,-5.1018,-3.4628,-0.6887,-6.5296,-4.3919,-3.5945,-1.3299,-7.6742,-1.9685,-5.3789,0.3238,-5.9681,95,1,12,17,6,5,3,5,7,7,7,1,0,0,4,3,5,5,6,6,2,3,1
BL1P137,10.8,male,1.01,1.07,3,3,2,7,7,6,2,4,6,3,0,36,,,,,,,,,-0.777,2.0065,3.2169,3.7865,-1.0539,1.1668,-0.8425,0.8243,2.4874,-2.5463,2.6255,2.5499,83,9,12,9,6,7,7,7,5,5,5,3,3,3,4,4,4,3,3,3,2,2,2
BL1P138,12.3,female,0.81,1.53,3,7,7,5,5,5,5,1,1,1,1.1,28,3.5,3.9,3.8,3.2,3.1,3.1,2.6,1,0.608,-1.4141,-1.9309,-1.9587,-5.4408,-2.9675,-1.7369,-4.0698,-2.1552,-2.7792,0.3797,-3.3301,,,,,,,,,,,,,,,,,,,,,,,
BL1P139,16.1,female,1,1.2,2,6,5,5,4,4,4,5,5,2,5.2,20,3,3.6,4.3,3.1,2.9,4.1,3.4,1.4,2.2766,-0.8676,2.4325,0.0041,-1.3463,0.3471,0.6625,4.8941,-3.427,0.2846,-0.0896,1.4388,81,12,18,6,0,12,12,6,0,0,0,6,6,0,6,6,6,0,0,6,0,0,0
BL1P140,,,1.61,1.28,,,,6,7,6,2,7,7,3,-2.4,29,,,,,,,,,,,,,,,,,,,,,,,,,,,,,,,,,,,,,,,,,,,
BL1P141,10.1,female,1.61,1.39,3,7,6,7,3,3,1,2,2,1,,,,,,,,,,,-3.644,-2.8369,2.6067,2.5142,-0.5222,-3.6707,-1.6402,-4.8908,-2.605,-2.7189,-7.2925,1.1638,81,10,12,8,6,8,8,6,4,4,4,3,4,3,5,4,3,3,2,3,1,2,3
BL1P142,10.5,female,1.52,1.33,,,,4,4,4,4,4,4,3,-2.3,43,,,,,,,,,,,,,,,,,,,,,,,,,,,,,,,,,,,,,,,,,,,
BL1P143,10.1,female,1.39,1.21,,,,5,5,5,3,4,4,1,1.3,39,,,,,,,,,,,,,,,,,,,,,,,,,,,,,,,,,,,,,,,,,,,
BL1P144,17,female,1.78,1.27,2,6,6,5,5,5,3,3,3,1,1,35,3,3.9,2.9,3.3,2.9,3.7,2.3,0.2,-0.5903,-0.9802,-7.0712,-1.7235,-2.8339,-1.2252,-2.8762,-1.4622,-2.5612,-3.4771,-2.8951,-0.2099,77,11,7,7,11,8,7,3,4,4,4,5,5,1,3,2,2,1,1,5,3,4,4
BL1P145,11.6,female,2.19,1.48,3,7,7,4,4,4,4,7,7,4,0.8,43,,,,,,,,,1.5143,1.2701,-3.0917,5.3214,1.1908,-0.9742,2.3001,-2.0817,-0.1567,-1.9485,-2.2587,-0.6923,94,3,17,15,1,7,7,6,5,5,5,1,1,1,6,6,5,5,5,5,0,0,1
BL1P147,12.3,female,2.84,1.28,5,6,6,3,6,6,4,6,6,5,,,,,,,,,,,-0.2613,-2.1581,0.2422,-5.0978,0.4355,-2.2362,-1.1226,-4.7972,-1.4182,-1.0678,-2.3275,-4.1263,84,6,6,12,12,0,4,8,12,12,12,0,2,4,0,2,4,6,4,2,6,4,2
BL1P148,15.4,female,1.71,1.14,3,7,7,5,6,6,6,7,7,3,5.5,27,3.5,3.1,4.1,3.1,3.1,2.6,2.8,1.2,-0.749,-2.5688,-6.1406,-3.9802,-3.0436,-3.4663,-1.0088,-7.6334,-1.909,-3.9674,-1.5651,-2.3719,84,8,11,10,7,8,4,7,4,4,4,4,1,3,4,3,4,2,5,3,2,3,2
BL1P149,15.4,female,1.49,1.84,4,6,6,4,6,6,4,7,7,3,-3.1,27,3.25,3.1,2.5,3.6,3.4,3.4,2.8,0.1,0.7968,0.9486,0.3536,-2.0738,-0.9992,0.2767,2.3696,-1.8848,0.0105,-0.2562,-0.0878,-1.9431,78,14,17,4,1,12,11,8,0,0,0,6,5,3,6,6,5,0,1,3,0,0,1
BL1P150,12.2,female,1.54,1.19,,,,7,6,6,3,5,5,5,3.4,45,2.5,2.6,3.7,3.9,2.9,3.3,3.5,1.6,,,,,,,,,,,,,,,,,,,,,,,,,,,,,,,,,,,
BL1P151,11,female,1.41,1.63,2,7,7,7,6,6,2,6,6,2,-3.9,34,,,,,,,,,-0.972,-3.9775,-4.0395,-3.9129,-3.126,-2.008,-5.8455,-2.3117,-1.4538,-1.4672,-0.7909,-3.7633,89,4,9,14,9,3,7,3,9,9,9,0,2,2,3,5,1,6,4,4,3,1,5
BL1P152,14.2,male,1.65,1.16,1,7,7,7,7,7,6,7,7,1,2.2,43,,,,,,,,,0.4188,-3.3212,-7.1978,-6.5658,-2.4547,-3.5416,-9.6093,-10.2717,-2.087,-5.2495,-3.6327,-3.2878,,,,,,,,,,,,,,,,,,,,,,,
BL1P153,15.3,female,1.01,1.16,4,7,6,6,5,5,3,6,6,2,-7.1,32,3,3,3.5,3.1,2.7,3.6,2.2,0.6,1.3191,-3.9231,-0.9445,-2.0642,2.6991,-3.8521,-6.0211,-4.0434,-3.13,-5.1955,7.9505,0.9207,,,,,,,,,,,,,,,,,,,,,,,
BL1P154,15.8,male,0.98,1.08,3,5,4,6,5,5,4,5,6,2,3.2,26,3,3.4,2.9,3.1,2.6,2.6,2.4,0,3.187,3.7143,0.5565,-0.6316,-1.318,-0.9772,0.0521,-0.807,-1.9781,3.5054,3.896,-2.0042,99,0,18,18,0,6,6,6,6,6,6,0,0,0,6,6,6,6,6,6,0,0,0
BL1P155,9,female,1,1.48,1,7,6,7,7,7,3,5,5,4,-0.6,38,,,,,,,,,-2.3759,-0.4832,-2.7103,-3.6386,-6.4588,0.6024,3.1248,-5.0825,-2.8196,-3.6677,2.4088,-0.6214,88,2,2,16,16,2,1,1,10,10,10,1,1,0,1,0,1,5,5,6,5,6,5
BL1P156,12.2,male,0.9,1.32,4,7,7,6,6,6,5,6,6,5,-0.1,41,3.25,3.6,2,4.1,3.4,3,1.8,0.1,-0.8653,-0.5549,1.7321,1.1671,3.268,1.3202,-4.6558,-1.5378,-0.4269,-3.0008,3.4394,-2.3436,81,10,11,8,7,10,7,4,2,2,2,5,4,1,5,3,3,1,2,5,1,3,3
BL1P157,14.3,male,1.05,1.29,,,,5,5,5,4,,,,2.3,42,2.75,3.4,3.6,3.1,4.3,3.1,3.2,0.7,1.9395,1.4645,2.4963,-1.5993,2.5414,-0.1656,0.1302,3.306,-1.3407,0.7536,0.9852,0.2855,78,10,5,8,13,6,6,3,6,6,6,3,4,3,3,2,0,3,2,3,3,4,6
BL1P158,13.2,female,1.7,1.19,3,6,5,6,5,4,2,3,5,2,-2.6,46,3.25,2.8,2.9,3.2,2.8,2.5,3,0.1,-0.0973,-1.2528,-2.0842,-0.8568,-0.1341,0.4325,-1.45,1.5855,-0.1015,-0.1168,-0.7368,-1.4436,92,4,15,14,3,7,6,6,5,5,5,2,1,1,5,5,5,4,5,5,1,1,1
BL1P159,11.5,female,1.17,1.52,3,7,6,4,4,4,4,6,6,5,4.2,38,,,,,,,,,-0.4973,-4.1077,-3.3018,2.2035,-2.8638,-3.8909,3.136,-2.9762,-2.78,-4.6274,-6.2386,-1.3374,85,9,17,9,1,10,8,8,2,2,2,4,3,2,6,5,6,2,3,4,0,1,0
BL1P160,10.8,female,1.16,1.37,2,7,7,5,5,5,5,3,3,3,-1.3,43,,,,,,,,,1.6896,0.0456,0.6181,-0.9386,3.9876,1.6478,-1.6967,-0.1226,0.8704,-1.9147,3.7219,0.3588,78,10,6,8,12,7,3,6,5,5,5,5,2,3,2,1,3,1,4,3,4,5,3
BL1P161,9.9,female,0.88,1.49,,,,5,4,4,5,6,6,6,-2.3,37,,,,,,,,,,,,,,,,,,,,,,,,,,,,,,,,,,,,,,,,,,,
BL1P162,17.8,male,0.91,1.12,3,6,6,5,3,3,2,4,4,3,-3.4,41,2.75,2.9,3.3,3.6,2.5,3.3,3.7,0.9,3.3901,0.1575,1.1356,0.0388,3.3544,-2.1131,8.3051,2.5704,2.6091,4.5957,1.5338,0.7502,77,11,7,7,11,8,10,0,4,4,4,5,6,0,3,4,0,1,0,6,3,2,6
BL1P163,14.8,female,1.19,1.47,4,7,7,5,6,6,5,7,7,5,6.6,33,3,4.4,3.6,3.9,3.7,4.3,3.5,1.5,0.2358,0.0125,-0.5754,-4.0311,-0.0205,-2.7663,-1.3742,-1.7149,1.0839,-1.4399,-0.7673,-1.8632,77,15,18,3,0,12,12,9,0,0,0,6,6,3,6,6,6,0,0,3,0,0,0
BL1P164,16.3,male,1.08,1.24,2,7,7,7,7,7,7,5,5,3,,,,,,,,,,,2.1744,3.922,3.5354,-2.392,2.2834,2.0032,-4.408,-0.2087,0.1722,-5.1332,5.6651,-4.3087,72,18,18,0,0,12,12,12,0,0,0,6,6,6,6,6,6,0,0,0,0,0,0
BL1P165,10.6,female,1.17,1.67,1,7,7,7,7,7,4,7,7,4,1.2,45,,,,,,,,,-2.6877,1.2711,-4.9687,-8.4494,1.2423,-3.7514,-1.2992,-3.6791,-3.2637,3.3839,7.1487,-1.2296,76,12,8,6,10,10,6,4,2,2,2,5,4,3,5,2,1,1,2,3,1,4,5
BL1P166,10.6,female,1.36,1.04,3,6,6,5,7,7,5,6,6,5,,,,,,,,,,,1.0902,2.6211,-0.5862,-1.6553,-6.5359,0.4284,-1.8887,-3.6152,-2.2599,-1.7881,0.1214,0.1235,80,11,12,7,6,8,8,7,4,4,4,3,5,3,5,3,4,3,1,3,1,3,2
BL1P167,15.7,female,,,4,6,6,5,5,5,4,5,5,4,-1.6,28,2.75,3.4,3,3.4,3.6,4.1,3.7,0.4,1.3944,-0.6497,-0.6875,0.1551,-1.7328,-3.0277,0.6872,-0.9745,0.5656,-3.7902,-0.2272,-0.2493,96,1,15,17,3,7,5,4,5,5,5,1,0,0,6,5,4,5,6,6,0,1,2
BL1P168,14.2,female,1.48,1.53,2,6,4,4,5,5,4,3,5,2,-3.7,30,2.5,3.7,3.7,2.9,3.5,2.8,2.5,0.6,-2.0744,-2.1817,0.58,-2.2698,-4.5175,-5.5748,1.5355,-3.4134,-5.779,-3.7155,-2.6034,-1.7656,84,9,14,9,4,8,7,8,4,4,4,4,3,2,4,4,6,2,3,4,2,2,0
BL1P169,10.7,male,1.23,1.14,1,2,2,7,7,7,1,3,3,1,1.6,42,,,,,,,,,2.0505,0.7871,-0.5304,-3.3231,0.8444,4.3026,1.548,5.4861,-3.8108,4.1848,-0.7237,-0.1796,88,4,7,14,11,5,5,1,7,7,7,2,2,0,3,3,1,4,4,6,3,3,5
BL1P170,14.5,male,1.39,1.05,1,7,7,6,5,5,5,7,7,1,0.3,40,2.75,3.4,3.4,3.4,3.5,3.3,2.9,0.8,-1.2432,0.8823,-0.4424,-0.1762,0.8994,0.2664,-1.2575,-2.6943,0.6084,-1.1992,-0.3286,-2.4123,80,11,13,7,5,8,11,5,4,4,4,4,6,1,4,5,4,2,0,5,2,1,2
BL1P171,13,female,2.14,1.21,2,6,6,6,7,7,6,6,6,5,3.7,34,4.5,3.4,2.9,3.6,3.3,3.3,3.5,0.5,-4.1969,-2.8804,-3.7425,-4.4446,-3.1067,-5.4931,5.7025,-6.6419,-1.6835,-3.2461,-0.3813,-7.0651,91,0,1,18,17,0,1,0,12,12,12,0,0,0,0,1,0,6,6,6,6,5,6
BL1P172,14.3,female,1.54,1.29,1,6,6,5,5,5,2,6,6,2,5.5,38,3,2.6,3.2,3.9,3.1,3.1,1.6,1.1,-0.2624,1.2719,-0.0248,0.6714,-0.2782,0.6199,4.3489,0.4632,-1.9074,-4.0469,1.3734,-4.1391,83,10,16,8,2,10,9,7,2,2,2,4,3,3,6,6,4,2,3,3,0,0,2
BL1P173,16.4,male,1.36,1.2,3,7,7,5,6,6,4,6,6,4,-3.1,38,3,2.6,2.1,3.5,3.1,3.9,2.8,-0.4,0.3102,-2.7594,-2.2433,-0.3503,3.1274,1.7444,-0.7424,-1.781,0.4442,1.0611,-1.376,-5.1485,85,8,13,10,5,9,9,3,3,3,3,4,4,0,5,5,3,2,2,6,1,1,3
BL1P174,17.6,male,1.48,1.21,3,6,5,6,6,6,3,5,5,2,-7.4,32,2.25,3.8,2.8,3.6,3.2,3.9,2.6,0.4,1.5791,0.7511,1.0737,1.1833,-0.0138,0.3534,2.7969,-1.7923,-1.3573,-1.0186,2.933,0.1655,93,4,18,14,0,8,8,6,4,4,4,2,2,0,6,6,6,4,4,6,0,0,0
BL1P175,11.4,female,1.45,1.38,,,,6,7,7,3,7,7,2,2.1,43,,,,,,,,,-0.6713,-3.8656,0.28,-3.6138,-0.4164,-3.887,0.0748,-0.7094,-3.295,-1.4895,-0.9265,-2.7279,87,3,3,15,15,2,1,3,10,10,10,1,0,2,1,1,1,5,6,4,5,5,5
BL1P176,17.2,male,1.27,1.57,5,6,1,4,7,3,4,3,7,5,,,,,,,,,,,-1.6107,-3.9727,-1.0539,-5.1257,0.506,-0.5173,-1.1153,-3.5776,1.1446,-0.4518,6.9714,-4.9459,93,4,17,14,1,10,5,6,2,2,2,4,0,0,6,5,6,2,6,6,0,1,0
BL1P177,16.8,female,1.56,1.01,4,7,2,6,7,2,4,2,7,4,2.4,36,2.75,3.6,3.6,3.3,4.7,3.8,3.8,0.9,-0.6984,-1.6089,-2.7327,-5.7514,-2.1408,-0.5308,-0.4169,-1.0152,-3.7294,-2.9659,-0.7565,-0.8143,88,6,14,12,4,9,3,8,3,3,3,3,0,3,6,3,5,3,6,3,0,3,1
BL1P178,16.7,female,1.06,1.4,4,7,7,5,5,5,3,6,6,2,-0.2,41,3.25,4.1,2.9,3.6,3.9,3.5,3.6,0.5,3.1198,3.3426,4.9182,3.2266,2.7386,0.2374,2.408,2.2975,1.4264,4.0271,6.2167,0.9182,86,7,13,11,5,8,6,6,4,4,4,3,2,2,5,4,4,3,4,4,1,2,2
BL1P179,13.6,female,1.5,1.06,3,7,7,5,5,5,4,5,5,4,0.9,33,3,3.3,3.7,3,3.5,3.4,3,0.7,4.0799,-3.1347,-0.8799,1.7203,2.3378,1.8164,2.0798,-3.1329,1.1713,-0.1297,1.2994,-0.9417,87,7,15,11,3,7,7,8,5,5,5,2,2,3,5,5,5,4,4,3,1,1,1
BL1P180,16.8,female,1.26,1.19,4,6,6,5,5,5,4,6,6,4,-3.6,38,2.5,3.6,3.1,3.5,3,3.3,3.5,0.6,-1.4942,-3.9772,-2.1262,-2.7132,-1.3776,-4.3396,-5.2455,-5.393,-3.3958,-1.7517,-3.1303,-3.0667,77,13,12,5,6,10,10,5,2,2,2,4,6,3,6,4,2,2,0,3,0,2,4
BL1P182,16.7,male,1.81,1.93,1,4,7,7,5,7,1,7,5,1,-2.3,43,3,2.4,2.2,3.6,1.7,3.2,2.1,-0.2,3.8325,-1.5543,-4.2569,-0.7192,-2.6863,-3.2171,-6.3983,-4.8072,-2.7066,-1.3134,1.1158,-0.5579,81,11,14,7,4,11,12,2,1,1,1,5,6,0,6,6,2,1,0,6,0,0,4
BL1P183,16.9,female,1.47,2.08,,,,6,6,5,3,5,7,1,3,34,3.25,3.6,3.4,3.6,3.1,2.6,2,1,,,,,,,,,,,,,,,,,,,,,,,,,,,,,,,,,,,
BL1P184,10.6,female,1.94,2,2,7,7,5,5,5,3,7,7,1,3.5,40,,,,,,,,,-2.7734,-5.1704,-1.6798,-2.4153,-1.1285,-3.3254,-5.1733,1.7886,0.9541,-1.5657,-1.9326,-0.688,94,3,16,15,2,8,5,6,4,4,4,2,0,1,6,5,5,4,6,5,0,1,1
BL1P185,15.8,female,1.52,2.26,5,5,5,5,4,3,6,4,4,6,3.7,32,2.75,3.4,4.3,3.6,2.9,3.9,3.3,1.9,-1.5622,-0.8101,-2.8954,3.5906,1.4814,1.421,1.0624,-1.3156,4.3061,-0.9593,-2.1266,1.2811,83,10,15,8,3,12,9,4,0,0,0,6,3,1,6,6,3,0,3,5,0,0,3
BL1P186,17.6,female,1.16,1.41,2,6,2,5,5,2,3,1,2,1,0.1,33,3.75,3.4,3.3,3.1,2.8,3.5,3.1,0.4,-0.1644,-4.0677,-3.9859,-3.3759,-1.423,-3.6206,-2.7849,-2.8111,-4.6482,-3.3489,-1.5131,-4.2616,93,4,17,14,1,7,7,7,5,5,5,1,1,2,6,6,5,5,5,4,0,0,1
BL1P187,17.3,female,1.2,2,3,5,5,4,4,4,4,2,2,2,1.9,28,3,1.9,3.1,3.9,2.9,3.1,4.8,1,1.5767,1.1724,1.8387,1.1777,-1.2607,1.1913,4.1812,-2.5273,1.1971,1.8031,3.9163,-1.3037,84,6,5,12,13,2,5,4,10,10,10,1,3,2,1,2,2,5,3,4,5,4,4